ID,"sex (1=M, 2=F)",age,Weight,Height,CKD_DM,CKD_HT,CKD_glomerulus,CKD_Obstruction,CKD_other,CKD_unknown,Renal replacement therapy,Dialysis vintage,post-covid month,admit day,ICU,isolation ward,hospitel,HI,DM,HT,IHD,HF,AF,HIV,Cancer,Current smoking,ACEI/ARB,Antiplatelets,Oral anticoagulation,Immunosuppressive drug,Vaccinated,Flavipiravir,ฟ้าทะลายโจร,Remdisivir,Corticosteroid,Tocilizumab,Baciritinib,Hemoperfusion,IV anticoagulation,Ivermactin,Molnupiravir,Mechanical ventilation,O2 support,O2 flow rate,O2 max flow rate,Hb,WBC,PMN (Neutrophil),LYM,Eosinophill,Platelet,CRP,IL-6,Alb,Ferritin,Fibrinogen,D-dimer,Bronchiectasis_RUL,Bronchiectasis_RML,Bronchiectasis_RLL,Bronchiectasis_LUL,Bronchiectasis_LLL,Honeycombing_RUL,Honeycombing_RML,Honeycombing_RLL,Honeycombing_LUL,Honeycombing_LLL,Parenchymal band_RUL,Parenchymal band_RML,Parenchymal band_RLL,Parenchymal band_LUL,Parenchymal band_LLL,Reticulation_RUL,Reticulation_RML,Reticulation_RLL,Reticulation_LUL,Reticulation_LLL,Ground-glass opacity_RUL,Ground-glass opacity_RML,Ground-glass opacity_RLL,Ground-glass opacity_LUL,Ground-glass opacity_LLL,Bronchiectasis_total,Honeycombing_total,Parenchymal band_total,Reticulation_total,Ground-glass opacity_total,Normal FVC,FVC LLN,FVC predict,%FVC predict,Normal FEV1 ,FEV1 LLN,FEV1 predict,%FEV1 predict,Normal FEV1/FVC ,FEV1/FVC LLN,FEV1/FVC predict,%FEV1/FVC predict,Normal FEF25-75%,FEF25-75% LLN,FEF25-75% predict,%FEF25-75% predict,interpretation,Severity
1,2,64,60.0,155,1,1,0,0,0,0,HD,8.0,11,9.0,0,1,0,0,1,1,0,0,0,0,0,0,0.0,0.0,0.0,0.0,2 AZ+mRNA,1,0,0.0,0,0,0,0,0,0,0,0,1,10.0,10.0,13.9,6.25,70.6,18.9,0.6,113.0,84.4,43.3,3.6,,,1.26,0,0,0,0,0,0,0,0,0,0,2,0,1,0,1,2.0,0,1,2,1,0,0,2,1,2,0,0,4,6,5,1.76,1.73,2.35,74.8936170212766,1.45,1.39,1.91,75.91623036649214,0.0,70.6,81.6,0.0,1.63,0.97,1.89,86.24338624338624,Normal ,
2,2,69,63.8,150,1,0,0,0,0,0,HD,2.0,9,12.0,0,1,0,0,1,1,0,0,0,0,0,0,1.0,0.0,0.0,0.0,2 AZ,1,0,0.0,0,0,0,0,0,0,0,0,0,,,12.5,5.48,71.6,17.2,0.9,205.0,12.7,21.6,3.6,,,,0,0,0,0,0,0,0,0,0,0,0,0,0,0,0,1.0,0,1,0,0,0,0,0,0,0,0,0,0,2,0,1.1,1.49,2.06,53.398058252427184,0.75,1.19,1.67,44.91017964071857,0.0,69.7,81.2,0.0,0.34,0.8,1.64,20.731707317073173,Severe obstruction ,
3,2,64,45.0,145,0,0,1,0,0,0,HD,4.0,11,18.0,0,1,0,0,1,1,0,0,0,0,0,0,0.0,0.0,0.0,0.0,2 AZ,1,0,0.0,1,0,0,0,1,1,0,0,1,10.0,10.0,8.8,5.77,82.3,12.8,0.2,144.0,43.8,,3.2,,,2.08,1,1,1,1,1,0,0,0,0,0,3,0,0,2,1,3.0,2,1,3,2,1,3,3,2,3,5,0,6,11,12,,,,,,,,,,,,,,,,,Cannot interprete,
4,2,68,54.0,155,1,0,0,0,0,0,HD,4.0,10,7.0,0,1,0,0,1,1,0,0,1,0,0,0,0.0,0.0,0.0,0.0,unvaccinated,1,0,0.0,1,0,0,0,0,0,0,0,0,,,11.1,11.57,89.4,8.1,0.1,348.0,350,1.92,3.5,,,0.76,0,0,0,0,0,0,0,0,0,0,0,0,0,0,0,2.0,2,2,2,2,0,0,0,0,2,0,0,0,10,2,2.21,1.6,2.22,99.54954954954954,1.69,1.27,1.79,94.41340782122904,0.0,69.4,80.9,0.0,1.45,0.84,1.71,84.7953216374269,Normal ,
5,1,47,55.0,165,0,0,0,0,1,0,HD,,9,13.0,0,1,0,0,0,1,0,0,0,0,0,0,0.0,0.0,0.0,0.0,1 AZ,1,0,0.0,0,0,0,0,0,0,0,0,0,,,12.6,3.63,62.2,22.6,4.1,92.0,20.7,27.0,3.9,,,2.78,0,0,0,0,0,0,0,0,0,0,0,0,0,0,0,0.0,0,0,0,0,1,0,0,0,0,0,0,0,0,1,1.59,2.96,3.79,41.95250659630607,1.57,2.45,3.14,50.0,0.0,73.5,83.0,0.0,2.65,1.98,3.32,79.81927710843374,Severe restriction ,
6,1,68,73.0,168,0,0,0,0,0,1,HD,6.0,12,13.0,0,1,0,0,0,1,0,0,0,0,0,0,0.0,0.0,0.0,0.0,other,1,0,0.0,0,0,0,0,0,0,0,0,0,,,11.8,4.75,58.5,24.2,5.5,255.0,7.58,9.1,3.6,,,,0,0,0,0,4,0,0,0,0,0,0,0,0,0,0,0.0,0,0,0,0,0,0,0,0,0,4,0,0,0,0,2.4,2.48,3.36,71.42857142857143,1.63,1.91,2.66,61.2781954887218,0.0,67.5,79.2,0.0,0.96,1.13,2.3,41.73913043478261,Restriction ,mild 
7,1,46,68.0,172,0,0,0,0,1,0,HD,0.75,3,0.0,0,0,0,1,0,1,0,0,0,0,0,0,1.0,1.0,0.0,1.0,2 AZ,1,0,0.0,0,0,0,0,0,0,0,0,0,,,,,,,,,,,,,,,0,0,0,0,0,0,0,0,0,0,0,0,0,0,0,0.0,0,0,0,0,0,0,0,0,0,0,0,0,0,0,2.9,3.27,4.19,69.21241050119332,2.33,2.69,3.45,67.53623188405797,0.0,73.0,82.4,0.0,2.15,2.12,3.56,60.39325842696629,Restriction ,moderate
8,2,55,72.5,157,1,0,0,0,0,0,HD,0.75,4,6.0,0,1,0,0,1,1,0,0,0,0,0,0,0.0,1.0,0.0,0.0,2 AZ,0,0,1.0,0,0,0,0,0,0,0,0,0,,,10.3,5.18,68.9,10.2,3.7,195.0,0.75,,4.4,,,1.66,0,0,0,0,0,0,0,0,0,0,0,0,0,0,0,0.0,0,0,0,0,0,0,0,0,0,0,0,0,0,0,2.21,1.98,2.61,84.67432950191571,1.94,1.61,2.15,90.23255813953487,0.0,72.3,82.4,0.0,2.39,1.24,2.24,106.69642857142856,Normal ,
9,2,60,50.0,155,1,0,0,0,0,0,HD,17.0,9,27.0,0,1,0,0,1,1,0,0,0,0,0,0,0.0,1.0,0.0,0.0,2 AZ+mRNA,1,0,0.0,0,0,0,0,0,0,0,0,1,10.0,10.0,10.0,3.3,77.3,20.0,0.0,254.0,96.8,42.5,2.7,,,,1,2,0,2,0,0,0,0,0,0,1,2,2,1,2,1.0,2,2,1,2,0,1,1,2,1,5,0,8,8,5,2.29,1.83,2.44,93.85245901639344,1.98,1.47,2.0,99.0,0.0,71.5,82.1,0.0,2.58,1.08,2.04,126.47058823529412,Normal ,
10,2,43,47.0,155,0,0,0,0,1,0,HD,2.0,15,10.0,0,0,1,0,0,1,0,0,0,0,0,0,0.0,0.0,0.0,0.0,2 AZ,1,0,0.0,0,0,0,0,0,0,0,0,0,,,,,,,,,,,,,,,0,0,0,0,0,0,0,0,0,0,0,0,0,0,0,1.0,0,0,1,0,0,0,0,0,0,0,0,0,2,0,2.49,2.19,2.79,89.24731182795699,2.02,1.83,2.36,85.59322033898306,0.0,74.9,84.5,0.0,2.1,1.68,2.74,76.64233576642336,Normal ,
11,2,56,70.0,155,1,0,0,0,0,0,HD,3.0,10,11.0,0,1,0,0,1,1,0,0,0,0,0,0,0.0,1.0,0.0,0.0,1 AZ,1,0,0.0,1,0,0,0,0,0,0,0,2,3.0,3.0,9.8,9.65,89.5,6.5,0.7,141.0,97.3,304.0,3.7,,,4.25,0,0,0,0,0,0,0,0,0,0,0,0,0,0,0,0.0,0,1,0,0,0,0,0,0,0,0,0,0,1,0,1.93,1.92,2.54,75.98425196850394,1.56,1.56,2.09,74.64114832535887,0.0,72.4,82.5,0.0,1.68,1.21,2.2,76.36363636363636,Normal ,
12,2,46,45.0,158,0,0,0,0,1,0,CAPD,8.0,11,7.0,0,1,0,0,0,1,0,0,0,0,1,0,1.0,0.0,0.0,0.0,unvaccinated,1,0,0.0,1,0,0,0,0,0,0,0,1,3.0,3.0,6.8,5.83,91.9,5.0,0.3,172.0,61.5,,2.0,204.0,,1.11,0,2,0,2,1,0,0,0,0,0,2,0,2,0,2,1.0,0,2,2,2,1,0,3,2,3,5,0,6,7,9,2.31,2.21,2.84,81.33802816901408,1.81,1.82,2.37,76.37130801687763,0.0,74.0,83.6,0.0,1.64,1.57,2.65,61.886792452830186,Normal ,
13,2,33,63.0,164,0,0,0,0,1,0,HD,1.5,11,12.0,0,1,0,0,0,1,0,0,0,0,0,0,0.0,0.0,0.0,1.0,2 AZ+mRNA,1,0,0.0,1,0,0,0,0,1,0,0,0,,,8.9,12.24,89.9,6.5,0.0,261.0,66.3,24.2,3.6,,,,0,0,0,0,0,0,0,0,0,0,0,0,1,0,0,0.0,0,0,0,0,0,0,0,0,0,0,0,1,0,0,2.44,2.61,3.3,73.93939393939394,2.1,2.23,2.84,73.94366197183099,0.0,76.5,86.3,0.0,2.52,2.16,3.33,75.67567567567568,Restriction ,mild 
14,2,37,40.0,140,0,0,0,0,0,1,HD,19.0,5,10.0,0,1,0,0,0,0,0,0,0,0,0,0,0.0,0.0,0.0,0.0,2 AZ,1,0,0.0,0,0,0,0,0,0,0,0,0,,,,,,,,,,,,,,,0,1,0,0,0,0,0,0,0,0,1,0,0,0,0,1.0,0,0,0,1,0,0,0,0,0,1,0,1,2,0,,,,,,,,,,,,,,,,,Cannot interprete,
15,1,65,61.0,168,0,0,0,0,0,1,HD,9.0,4,7.0,0,1,0,0,0,1,0,0,0,0,0,0,0.0,0.0,0.0,0.0,2 AZ,1,0,0.0,1,0,0,0,0,0,0,0,0,,,10.8,7.43,79.5,11.7,1.2,114.0,62.1,,4.2,,,1.01,0,0,0,0,0,0,0,0,0,0,0,0,0,0,0,0.0,0,0,0,0,0,0,0,0,0,0,0,0,0,0,2.48,2.57,3.45,71.8840579710145,1.91,2.0,2.75,69.45454545454545,0.0,68.3,79.6,0.0,1.68,1.24,2.44,68.85245901639344,Restriction ,mild
16,2,62,63.3,150,1,0,0,0,0,0,HD,1.0,7,20.0,0,1,0,0,1,1,1,0,0,0,0,0,0.0,0.0,0.0,0.0,2 AZ+mRNA,1,0,0.0,0,0,0,0,0,0,0,0,0,,,10.6,9.06,73.7,12.9,3.4,232.0,2.94,,4.0,,,0.38,0,0,0,0,0,0,0,0,0,0,0,0,0,2,0,0.0,0,0,0,0,0,0,0,0,0,0,0,2,0,0,,,,,,,,,,,,,,,,,Cannot interprete,
17,2,63,72.0,150,1,0,0,0,0,0,HD,3.0,9,13.0,0,1,0,0,1,1,0,0,0,0,0,0,0.0,0.0,0.0,0.0,2 mRNA,1,0,0.0,1,0,0,0,0,0,0,0,0,,,7.7,4.86,72.9,21.8,0.0,241.0,12.7,17.4,2.9,,,1.09,0,0,1,0,0,0,0,0,0,0,0,0,0,0,0,0.0,0,0,2,0,0,0,2,0,0,1,0,0,2,2,,,,,,,,,,,,,,,,,Cannot interprete,
18,1,41,58.0,167,0,1,0,0,0,0,HD,2.0,5,10.0,0,1,0,0,0,1,0,0,0,0,0,0,1.0,0.0,0.0,0.0,2 AZ,1,0,0.0,0,0,0,0,0,0,0,0,0,,,,,,,,,,,,,,,0,0,0,0,0,0,0,0,0,0,0,0,0,0,0,0.0,0,0,0,0,0,0,0,0,0,0,0,0,0,0,4.06,3.15,4.0,101.49999999999999,3.55,2.62,3.34,106.2874251497006,0.0,83.7,74.4,0.0,4.5,2.23,3.62,124.30939226519338,Normal ,
19,1,66,46.0,170,0,0,0,0,0,1,HD,1.0,4,7.0,0,1,0,0,0,0,0,0,0,0,0,0,0.0,0.0,0.0,0.0,2 AZ,1,0,0.0,0,0,0,0,0,0,0,0,0,,,10.0,5.55,61.9,27.6,0.4,205.0,,,3.5,301.0,,,0,0,0,0,0,0,0,0,0,0,1,0,0,0,0,0.0,0,0,1,0,0,0,0,0,0,0,0,1,1,0,2.64,2.58,3.48,75.86206896551725,2.25,1.99,2.76,81.5217391304348,0.0,67.6,79.2,0.0,2.38,1.19,2.39,99.58158995815899,Normal ,
20,2,72,42.0,138,1,0,0,0,0,0,HD,5.0,3,0.0,0,0,0,1,1,0,0,0,0,0,0,0,0.0,0.0,0.0,0.0,2 AZ+mRNA,1,0,0.0,0,0,0,0,0,0,0,0,0,,,,,,,,,,,,,,,0,0,5,0,0,0,0,0,0,0,0,0,0,0,0,0.0,0,0,2,0,0,0,0,0,0,5,0,0,2,0,1.5,1.19,1.67,89.82035928143713,1.31,0.96,1.36,96.32352941176471,0.0,69.8,81.7,0.0,1.56,0.67,1.4,111.42857142857143,Normal ,
21,2,30,42.0,157,0,0,0,0,1,0,HD,0.5,3,10.0,0,1,0,0,0,1,0,0,0,0,0,0,0.0,0.0,0.0,1.0,unvaccinated,1,0,0.0,0,0,0,0,0,0,0,0,0,,,,,,,,,,,,,,,0,0,0,0,0,0,0,0,0,0,0,0,0,0,1,0.0,0,0,0,0,0,0,0,0,0,0,0,1,0,0,2.99,2.38,3.01,99.3355481727575,2.29,2.07,2.63,87.07224334600761,0.0,77.5,87.5,0.0,1.99,2.13,3.24,61.419753086419746,Obstruction ,mild
22,2,55,55.0,155,0,0,0,0,0,1,HD,5.0,3,3.0,0,1,0,0,1,1,1,0,0,0,0,0,0.0,1.0,0.0,0.0,unvaccinated,1,0,0.0,0,0,0,0,0,0,0,0,0,,,9.3,7.44,62.1,23.7,5.9,260.0,3.34,,4.1,,,0.69,0,0,0,0,1,0,0,0,0,0,0,0,0,0,1,0.0,0,0,0,0,0,0,0,0,0,1,0,1,0,0,1.97,1.99,2.6,75.76923076923077,1.65,1.63,2.15,76.74418604651163,0.0,73.0,82.9,0.0,2.1,1.32,2.33,90.12875536480686,Restriction ,mild 
23,2,54,49.0,160,0,1,0,0,0,0,HD,9.0,12,12.0,0,1,0,0,0,1,0,0,0,0,0,0,0.0,0.0,0.0,0.0,2 AZ+mRNA,1,0,0.0,0,0,0,0,0,0,0,0,0,,,,,,,,,,,,,,,0,2,1,0,0,0,0,0,0,0,0,2,2,1,0,0.0,2,2,1,0,0,0,0,0,0,3,0,5,5,0,2.36,2.12,2.77,85.19855595667869,2.0,1.72,2.28,87.71929824561404,0.0,72.5,82.5,0.0,2.48,1.34,2.39,103.76569037656904,Normal ,
24,2,58,75.0,165,1,0,0,0,0,0,HD,3.0,4,7.0,0,0,1,0,1,1,0,0,0,0,0,0,0.0,0.0,0.0,0.0,2 AZ+mRNA,1,0,0.0,0,0,0,0,0,0,0,0,0,,,,,,,,,,,,,,,0,0,0,0,0,0,0,0,0,0,0,0,0,0,0,0.0,0,1,0,1,0,0,0,0,2,0,0,0,2,2,2.5,2.16,2.87,87.10801393728222,2.08,1.73,2.34,88.8888888888889,0.0,71.5,81.7,0.0,2.42,1.25,2.32,104.3103448275862,Normal ,
25,2,57,75.0,155,1,1,0,0,0,0,CAPD,3.0,3,9.0,1,0,0,0,1,1,1,0,0,0,0,0,0.0,0.0,0.0,0.0,2 AZ,1,0,0.0,0,0,0,0,0,0,0,0,0,,,7.8,5.81,60.7,21.3,7.9,205.0,12.5,,3.7,695.0,,1.65,0,0,0,0,0,0,0,0,0,0,0,0,0,0,0,0.0,2,1,1,0,0,0,0,0,0,0,0,0,4,0,2.22,1.87,2.49,89.1566265060241,1.92,1.52,2.05,93.65853658536587,0.0,72.0,82.3,0.0,2.4,1.15,2.12,113.20754716981132,Normal ,
26,1,26,62.0,185,0,0,0,0,1,0,HD,6.0,10,21.0,0,1,0,0,0,1,0,0,0,0,0,0,0.0,0.0,0.0,0.0,2 mRNA,1,0,0.0,0,0,0,0,0,0,0,0,0,,,,,,,,,,,,,,,5,5,5,5,5,0,0,0,0,0,0,0,0,0,0,0.0,0,0,0,0,0,0,0,0,0,25,0,0,0,0,,,,,,,,,,,,,,,,,Cannot interprete,
27,1,68,59.0,167,0,0,0,0,0,1,HD,3.0,4,2.0,0,1,0,0,0,1,0,0,0,0,0,0,1.0,0.0,0.0,0.0,2 AZ,1,0,0.0,0,0,0,0,0,0,0,0,1,10.0,10.0,6.9,6.28,83.2,5.1,0.8,220.0,,,2.7,,,,4,4,4,4,4,0,0,0,0,0,0,0,0,0,0,0.0,0,2,0,2,0,0,0,0,0,20,0,0,4,0,,,,,,,,,,,,,,,,,Cannot interprete,
28,1,65,68.0,173,1,0,0,0,0,0,HD,6.0,9,6.0,0,1,0,0,1,1,0,0,1,0,0,0,0.0,0.0,0.0,0.0,other,1,0,0.0,0,0,0,0,0,0,0,0,0,,,7.7,5.41,53.3,20.1,17.0,370.0,4.73,7.53,3.9,,,,0,0,0,0,0,0,0,0,0,0,0,0,0,0,0,1.0,0,1,0,1,0,0,0,0,0,0,0,0,3,0,,,,,,,,,,,,,,,,,Cannot interprete,
29,1,78,70.0,170,1,0,0,0,0,0,HD,2.0,3,5.0,0,1,0,0,1,1,0,0,0,0,0,0,1.0,1.0,0.0,0.0,2 AZ,1,0,0.0,0,0,0,0,0,0,0,0,0,,,8.0,13.25,82.0,8.0,2.0,218.0,48.8,,4.2,,,0.64,0,0,0,0,0,0,0,0,0,0,1,0,2,0,0,1.0,1,2,1,1,0,0,0,0,0,0,0,3,6,0,,,,,,,,,,,,,,,,,Cannot interprete,
30,1,57,49.0,159,0,0,0,0,1,0,HD,13.0,3,10.0,0,0,1,0,0,1,0,0,0,0,0,0,0.0,0.0,0.0,0.0,2 mRNA,1,0,0.0,0,0,0,0,0,0,0,0,0,,,,,,,,,,,,,,,0,0,0,0,0,0,0,0,0,0,0,0,0,0,0,0.0,0,0,0,0,4,4,4,4,4,0,0,0,0,20,1.3,2.46,3.23,40.247678018575854,1.11,1.99,2.64,42.04545454545455,0.0,71.2,81.6,0.0,1.42,1.42,2.6,54.61538461538461,Restriction ,severe 
31,1,53,68.0,171,0,0,0,0,0,1,HD,26.0,7,19.0,0,1,0,0,0,1,0,0,0,0,0,0,0.0,0.0,1.0,0.0,2 SV/SP+2 AZ,1,0,0.0,0,0,0,0,0,0,0,0,0,,,,,,,,,,,,,,,0,0,0,0,0,0,0,0,0,0,0,1,0,1,1,0.0,0,0,0,0,1,1,1,1,1,0,0,3,0,5,3.73,3.02,3.93,94.91094147582697,2.98,2.44,3.19,93.41692789968651,0.0,71.2,81.2,0.0,2.83,1.74,3.1,91.29032258064515,Normal ,
32,2,46,52.0,170,0,0,0,0,1,0,HD,5.0,7,28.0,1,1,0,0,0,1,0,0,0,0,0,0,0.0,0.0,0.0,0.0,2 AZ,1,0,0.0,0,0,0,0,0,0,0,0,0,,,,,,,,,,,,,,,0,0,0,0,0,0,0,0,0,0,0,0,0,0,0,0.0,0,1,1,1,0,0,0,0,0,0,0,0,3,0,2.9,2.61,3.36,86.30952380952381,2.37,2.13,2.77,85.55956678700362,0.0,73.4,82.9,0.0,2.51,1.74,2.94,85.37414965986395,Normal ,
33,2,53,55.0,153,0,1,0,0,0,0,HD,21.0,5,14.0,0,1,0,0,0,1,0,0,1,0,0,0,0.0,0.0,1.0,0.0,2 AZ,1,0,0.0,0,0,0,0,0,0,0,0,0,,,,,,,,,,,,,,,0,0,0,0,0,0,0,0,0,0,0,0,1,1,0,0.0,0,0,0,0,0,0,0,0,0,0,0,2,0,0,2.23,1.93,2.53,88.14229249011858,1.94,1.58,2.1,92.38095238095238,0.0,73.1,83.0,0.0,3.03,1.29,2.29,132.31441048034932,Normal ,
34,1,38,53.0,183,0,0,0,0,0,1,HD,2.0,5,3.0,0,1,1,0,0,1,0,0,0,0,0,1,0.0,0.0,0.0,0.0,2 AZ+mRNA,1,0,0.0,0,0,0,0,0,0,0,0,0,,,,,,,,,,,,,,,1,0,0,0,0,0,0,0,0,0,0,1,1,1,2,1.0,1,1,1,2,2,2,2,2,2,1,0,5,6,10,3.82,3.97,5.03,75.94433399602384,2.93,3.26,4.15,70.60240963855422,0.0,73.7,82.9,0.0,2.86,2.69,4.32,66.2037037037037,Restriction ,mild 
35,2,67,54.0,160,1,0,0,0,0,0,HD,4.0,4,0.0,0,0,0,1,1,1,0,0,0,0,0,0,1.0,0.0,0.0,0.0,AZ+mRNA,1,0,0.0,0,0,0,0,0,0,0,0,0,,,9.5,3.21,54.5,25.9,11.5,125.0,,,4.2,927.0,,,0,0,0,0,0,0,0,0,0,0,0,1,2,0,0,0.0,0,0,1,1,0,3,0,1,0,0,0,3,2,4,1.62,1.77,2.44,66.39344262295083,1.33,1.41,1.97,67.51269035532995,0.0,69.7,80.9,0.0,1.42,0.93,1.86,76.34408602150536,Restriction ,mild 
36,1,45,94.0,180,1,0,0,0,0,0,HD,0.5,3,0.0,0,0,0,1,1,1,0,0,0,0,0,0,0.0,0.0,0.0,0.0,2 AZ+mRNA,1,0,0.0,0,0,0,0,0,0,0,0,0,,,,,,,,,,,,,,,0,0,0,0,0,0,0,0,0,0,0,0,0,0,1,0.0,0,0,0,0,0,0,0,0,0,0,0,1,0,0,2.86,3.68,4.7,60.851063829787236,2.34,3.0,3.84,60.9375,0.0,72.7,82.0,0.0,2.4,2.34,3.9,61.53846153846154,Restriction ,moderate
37,2,64,50.0,155,0,0,0,0,0,1,HD,11.0,3,7.0,0,1,0,0,0,1,0,0,0,0,0,0,1.0,1.0,0.0,0.0,2 SV/SP+2 AZ,1,0,0.0,0,0,0,0,0,0,0,0,0,,,,,,,,,,,,,,,0,0,0,0,0,0,0,0,0,0,0,0,0,0,0,0.0,0,0,0,0,1,1,1,1,1,0,0,0,0,5,1.57,1.7,2.32,67.67241379310346,1.17,1.36,1.89,61.904761904761905,0.0,70.4,81.5,0.0,0.99,0.94,1.85,53.51351351351351,Restriction ,moderate 
38,1,46,75.0,180,0,0,0,0,0,1,HD,8.0,3,7.0,0,1,0,0,1,1,0,0,0,0,0,0,0.0,0.0,0.0,0.0,AZ+mRNA,1,0,0.0,0,0,0,0,0,0,0,0,0,,,9.9,4.6,58.2,18.5,11.3,175.0,<0.3,,4.2,,,0.6,0,0,0,0,0,0,0,0,0,0,0,0,0,0,0,0.0,0,0,0,0,0,0,0,0,0,0,0,0,0,0,3.14,3.65,4.67,67.23768736616704,2.52,2.97,3.81,66.14173228346458,0.0,72.5,81.8,0.0,2.44,2.29,3.84,63.541666666666664,Restriction ,moderate 
39,1,67,70.0,170,1,0,0,0,0,0,HD,6.0,3,8.0,0,1,0,0,1,1,0,0,0,0,0,0,1.0,1.0,0.0,0.0,2 AZ+mRNA,1,0,1.0,0,0,0,0,0,0,0,0,0,,,9.7,6.36,64.0,19.3,7.4,122.0,3.78,,4.2,,,,0,0,0,0,0,0,0,0,0,0,0,0,0,0,0,0.0,1,0,0,0,0,0,0,0,0,0,0,0,1,0,3.1,2.52,3.42,90.64327485380117,2.86,1.93,2.7,105.92592592592591,0.0,67.1,78.9,0.0,5.01,1.12,2.3,217.82608695652175,Normal ,
40,1,64,67.0,163,1,0,0,0,0,0,HD,4.0,10,14.0,0,1,0,0,1,1,1,0,0,0,0,0,0.0,1.0,0.0,0.0,2 AZ+mRNA,1,0,0.0,0,0,0,0,0,0,0,0,0,,,,,,,,,,,,,,,0,0,0,0,0,0,0,0,0,0,0,0,0,1,0,0.0,0,0,0,0,0,0,0,0,0,0,0,1,0,0,2.32,2.41,3.23,71.8266253869969,1.9,1.9,2.6,73.07692307692307,0.0,68.9,80.2,0.0,2.04,1.21,2.36,86.4406779661017,Restriction ,mild
41,2,61,44.0,150,0,1,0,0,0,0,HD,1.0,3,12.0,0,0,1,0,0,1,0,0,0,0,0,0,0.0,0.0,0.0,0.0,2 AZ+mRNA,1,0,0.0,0,0,0,0,0,0,0,0,0,,,,,,,,,,,,,,,0,0,0,0,0,0,0,0,0,0,0,0,0,0,0,0.0,1,2,0,2,0,0,0,0,0,0,0,0,5,0,2.26,1.67,2.25,100.44444444444443,1.77,1.35,1.85,95.67567567567568,0.0,71.6,82.2,0.0,1.78,1.01,1.91,93.19371727748693,Normal ,
42,2,70,54.0,154,0,0,1,0,0,0,HD,1.0,12,13.0,0,1,0,0,0,1,0,0,0,0,0,0,0.0,0.0,0.0,0.0,2 AZ+mRNA,1,0,0.0,1,0,0,0,0,0,0,0,0,,,8.1,7.37,70.1,25.6,0.0,285.0,75.4,28.3,3.0,,,,0,0,0,0,0,0,0,0,0,0,0,0,0,0,0,0.0,0,1,0,1,0,0,0,0,0,0,0,0,2,0,2.26,1.53,2.14,105.60747663551399,1.93,1.21,1.72,112.20930232558139,0.0,69.0,80.7,0.0,2.57,0.78,1.64,156.70731707317074,Normal ,
43,1,69,62.0,168,1,0,0,0,0,0,CAPD,4.0,12,2.0,0,1,0,0,0,1,1,0,0,0,0,0,1.0,1.0,0.0,0.0,AZ+mRNA,1,0,0.0,0,0,0,0,0,0,0,0,0,,,,,,,,,,,,,,,0,0,1,0,0,0,0,0,0,0,0,1,0,0,0,0.0,2,1,0,0,2,1,1,2,0,1,0,1,3,6,2.42,2.45,3.32,72.89156626506023,1.8,1.88,2.63,68.44106463878327,0.0,67.2,79.0,0.0,1.85,1.1,2.25,82.22222222222223,Restriction ,mild 
44,1,67,60.0,165,1,0,0,0,0,0,HD,3.0,4,14.0,0,1,0,0,1,0,1,0,0,0,0,0,0.0,1.0,1.0,0.0,2 AZ+mRNA,1,0,0.0,0,0,0,0,0,0,0,0,0,,,6.3,5.34,65.3,14.0,12.5,291.0,,,4.0,,,,5,5,5,5,5,0,0,0,0,0,0,0,0,0,1,0.0,0,0,0,0,0,0,0,0,0,25,0,1,0,0,,,,,,,,,,,,,,,,,Cannot interprete,
45,1,49,74.0,176,0,0,0,0,0,1,HD,20.0,3,8.0,0,1,0,0,0,1,0,0,0,0,0,0,0.0,0.0,0.0,0.0,2 AZ+mRNA,1,0,0.0,0,0,0,0,0,0,0,0,0,,,,,,,,,,,,,,,0,0,0,0,0,0,0,0,0,0,0,1,1,1,1,0.0,0,0,0,0,0,0,0,0,0,0,0,4,0,0,3.29,3.38,4.35,75.63218390804597,2.61,2.75,3.55,73.52112676056338,0.0,72.1,81.7,0.0,2.49,2.06,3.54,70.33898305084746,Restriction ,mild
46,2,47,60.0,145,0,1,0,0,0,0,HD,20.0,12,14.0,0,1,0,0,0,1,0,0,0,0,0,0,0.0,0.0,0.0,0.0,SV1+AZ2,0,0,0.0,0,0,0,0,0,0,0,0,0,,,12.3,5.77,57.4,19.2,15.4,203.0,,,4.3,,,,0,0,0,0,0,0,0,0,0,0,0,0,0,0,0,0.0,2,0,0,0,0,0,2,2,0,0,0,0,2,4,1.74,1.81,2.33,74.67811158798283,1.31,1.5,1.96,66.83673469387756,0.0,74.5,84.2,0.0,1.08,1.36,2.31,46.753246753246756,Restriction ,mild
47,2,42,63.0,168,0,0,0,0,1,0,HD,7.0,4,14.0,0,1,0,0,0,0,0,0,0,0,0,0,0.0,0.0,0.0,0.0,2 AZ+mRNA,1,0,0.0,0,0,0,0,0,0,0,0,0,,,,,,,,,,,,,,,0,0,0,0,0,0,0,0,0,0,0,0,0,0,0,0.0,0,0,0,0,0,0,0,1,0,0,0,0,0,1,3.23,2.63,3.35,96.41791044776119,2.88,2.17,2.8,102.85714285714288,0.0,74.3,83.8,0.0,4.27,1.88,3.07,139.08794788273616,Normal ,
48,1,40,85.0,178,1,0,0,0,0,0,CAPD,3.0,4,10.0,0,1,0,0,1,1,0,0,0,0,0,0,0.0,0.0,0.0,0.0,2 AZ+mRNA,1,0,0.0,0,0,0,0,0,0,0,0,0,,,,,,,,,,,,,,,0,0,0,0,0,0,0,0,0,0,0,0,0,0,1,,0,1,0,1,0,0,0,0,0,0,0,1,2,0,2.97,3.7,4.68,63.46153846153847,2.29,3.05,3.88,59.02061855670103,0.0,73.9,83.1,0.0,1.92,2.53,4.08,47.05882352941176,Restriction ,moderate 
49,1,72,64.0,168,0,0,0,0,1,0,HD,4.0,3,2.0,0,1,0,0,0,1,0,0,0,0,0,0,0.0,1.0,0.0,0.0,2 AZ,1,0,0.0,0,0,0,0,0,0,0,0,0,,,,,,,,,,,,,,,0,5,5,0,5,0,0,0,0,0,1,0,1,0,1,0.0,0,0,0,0,0,0,0,0,0,15,0,3,0,0,2.16,2.36,3.24,66.66666666666666,1.88,1.79,2.54,74.01574803149606,0.0,66.4,78.6,0.0,2.64,1.01,2.12,124.52830188679245,Restriction ,moderate 
50,1,54,69.0,185,1,0,0,0,0,0,CAPD,2.0,3,0.0,0,0,0,1,1,1,0,0,0,0,0,0,1.0,0.0,0.0,0.0,2 AZ+mRNA,1,0,0.0,0,0,0,0,0,0,0,0,0,,,,,,,,,,,,,,,1,0,2,2,3,0,0,0,0,0,0,1,1,2,2,1.0,1,2,2,2,0,0,2,0,0,8,0,6,8,2,2.48,3.65,4.76,52.10084033613446,2.15,2.9,3.8,56.57894736842105,0.0,70.3,80.2,0.0,2.54,1.99,3.54,71.75141242937853,Restriction ,moderate 
51,1,45,83.0,168,1,0,0,0,0,0,CAPD,4.0,11,0.0,0,0,0,1,1,1,0,0,0,0,0,0,0.0,0.0,0.0,0.0,unvaccinated,1,1,0.0,0,0,0,0,0,0,0,0,0,,,,,,,,,,,,,,,0,0,0,0,0,0,0,0,0,0,0,0,0,0,0,0.0,0,0,0,1,1,0,0,0,1,0,0,0,1,2,3.26,3.09,3.96,82.32323232323232,2.65,2.55,3.27,81.03975535168195,0.0,73.3,82.7,0.0,3.21,2.04,3.42,93.85964912280701,Normal ,
52,1,41,48.0,168,0,1,0,0,0,0,HD,6.0,3,14.0,0,1,0,0,1,0,0,0,0,0,0,0,0.0,1.0,0.0,0.0,unvaccinated,0,0,1.0,0,0,0,0,0,0,0,0,0,,,5.9,8.25,75.7,17.9,1.9,350.0,128,,2.2,3254.0,,,0,0,0,0,0,0,0,0,0,0,2,5,5,1,4,0.0,0,0,2,1,0,0,0,0,0,0,0,17,3,0,1.8,3.18,4.04,44.554455445544555,1.43,2.64,3.36,42.55952380952381,0.0,74.1,83.4,0.0,1.32,2.21,3.61,36.56509695290859,Restriction ,severe
53,2,57,57.0,188,1,1,0,0,0,0,HD,3.0,3,15.0,0,0,0,1,1,1,1,0,0,0,0,0,0.0,1.0,0.0,0.0,2 AZ+mRNA,1,0,0.0,0,0,0,0,0,0,0,0,0,,,,,,,,,,,,,,,0,0,0,0,0,0,0,0,0,0,0,0,0,0,0,0.0,0,0,0,1,0,0,0,0,0,0,0,0,1,0,1.89,2.94,3.89,48.58611825192802,1.57,2.32,3.11,50.4823151125402,0.0,70.7,80.7,0.0,2.1,1.55,2.84,73.94366197183099,Restriction ,severe
54,1,59,74.0,173,1,0,0,0,0,0,HD,4.0,3,9.0,0,1,0,0,0,0,0,0,0,0,0,0,1.0,0.0,0.0,0.0,2 AZ+mRNA,1,0,0.0,0,0,0,0,0,0,0,0,0,,,,,,,,,,,,,,,0,0,0,0,0,0,0,0,0,0,0,0,0,0,0,0.0,0,0,0,0,0,0,0,0,0,0,0,0,0,0,3.13,2.95,3.9,80.25641025641026,2.67,2.34,3.12,85.57692307692307,0.0,69.7,80.2,0.0,3.66,1.55,2.88,127.08333333333334,Normal ,
55,1,45,53.0,160,0,1,0,0,0,0,HD,19.0,3,7.0,0,1,0,0,1,0,0,0,0,0,0,0,0.0,0.0,0.0,0.0,2 AZ+mRNA,1,0,0.0,0,0,0,0,0,0,0,0,0,,,,,,,,,,,,,,,0,0,0,0,0,0,0,0,0,0,0,0,1,0,0,0.0,0,2,0,1,0,0,1,0,0,0,0,1,3,1,2.88,2.75,3.52,81.81818181818181,2.32,2.29,2.93,79.18088737201364,0.0,73.9,83.4,0.0,2.37,1.88,3.15,75.23809523809526,Normal ,
56,2,60,67.0,165,1,0,0,0,0,0,HD,0.5,3,15.0,0,1,0,0,1,1,1,0,0,0,0,0,0.0,0.0,1.0,0.0,2 AZ,1,0,0.0,0,0,0,0,0,0,0,0,0,,,10.7,5.68,39.9,41.7,10.6,255.0,2.32,,3.9,,,,0,0,0,0,0,0,0,0,0,0,0,0,0,0,0,1.0,0,0,1,0,0,0,0,0,0,0,0,0,2,0,1.94,2.07,2.79,69.53405017921148,1.31,1.66,2.26,57.96460176991152,0.0,70.8,81.4,0.0,0.84,1.15,2.19,38.35616438356164,Obstruction ,moderate
57,2,74,56.0,152,1,1,0,0,0,0,CAPD,3.0,4,14.0,0,0,0,1,1,1,0,0,0,0,0,0,1.0,0.0,0.0,0.0,unvaccinated,1,0,0.0,0,0,0,0,0,0,0,0,0,,,10.1,6.31,68.8,22.3,2.9,267.0,,,3.6,457.0,,,1,0,0,2,0,0,0,0,0,0,0,0,0,0,0,0.0,0,2,1,2,2,0,2,0,2,3,0,0,5,6,,,,,,,,,,,,,,,,,Cannot interprete,
58,2,42,66.0,150,1,0,0,0,0,0,HD,6.0,11,18.0,1,0,0,0,1,1,1,0,0,0,0,0,0.0,1.0,0.0,0.0,2 AZ+mRNA,1,0,0.0,0,0,0,0,0,0,0,0,1,3.0,3.0,,,,,,,,,,,,,0,0,0,0,0,0,0,0,0,0,0,0,0,0,1,0.0,1,2,2,2,0,1,1,2,2,0,0,1,7,6,1.95,2.05,2.61,74.71264367816092,1.58,1.73,2.22,71.17117117117117,0.0,75.4,85.0,0.0,1.78,1.64,2.65,67.16981132075472,Restriction ,mild
59,2,34,50.0,160,0,0,0,0,0,1,HD,8.0,7,7.0,0,0,1,0,0,1,0,0,0,0,0,0,1.0,0.0,0.0,0.0,2 SV/SP+2 AZ,1,0,0.0,0,0,0,0,0,0,0,0,0,,,,,,,,,,,,,,,0,0,0,0,0,0,0,0,0,0,0,0,0,0,0,0.0,0,0,0,0,0,0,0,0,0,0,0,0,0,0,2.27,2.46,3.12,72.75641025641025,1.93,2.11,2.68,72.01492537313432,0.0,76.4,86.2,0.0,2.33,2.05,3.18,73.27044025157232,Restriction ,mild
60,2,47,49.0,163,0,1,0,0,0,0,HD,7.0,13,16.0,0,1,0,0,0,1,0,0,0,0,0,0,0.0,1.0,0.0,0.0,AZ+mRNA,1,0,0.0,0,0,0,0,0,0,0,0,1,3.0,3.0,,,,,,,,,,,,,2,0,0,2,0,0,0,0,0,0,2,0,1,2,1,2.0,1,2,2,1,2,0,0,1,0,4,0,6,8,3,2.08,2.44,3.11,66.88102893890677,1.71,2.02,2.6,65.76923076923077,0.0,74.3,83.8,0.0,1.94,1.76,2.9,66.89655172413794,Restriction ,moderate
61,2,45,64.0,149,0,1,0,0,0,0,HD,10.0,3,11.0,0,0,1,0,1,0,0,0,0,0,0,0,0.0,0.0,0.0,0.0,2 AZ+mRNA,1,0,0.0,0,0,0,0,0,0,0,0,0,,,,,,,,,,,,,,,0,0,0,0,0,0,0,0,0,0,0,0,0,0,0,2.0,0,0,2,0,0,0,2,0,0,0,0,0,4,2,1.42,1.97,2.52,56.34920634920635,1.17,1.65,2.13,54.929577464788736,0.0,74.8,84.5,0.0,1.34,1.52,2.52,53.17460317460318,Restriction ,moderate
62,2,74,64.0,158,0,0,0,0,1,0,HD,8.0,3,7.0,0,1,0,0,1,1,0,0,0,0,0,0,0.0,1.0,0.0,0.0,2 AZ,1,0,0.0,0,0,0,0,0,0,0,0,0,,,8.9,8.17,62.6,25.1,4.2,120.0,23.2,,4.0,,,1.47,0,0,0,0,0,0,0,0,0,0,0,0,0,0,0,0.0,0,0,0,0,0,0,0,0,0,0,0,0,0,0,1.47,1.57,2.22,66.21621621621621,1.19,1.24,1.77,67.23163841807909,0.0,68.3,80.3,0.0,1.08,0.77,1.63,66.25766871165645,Restriction ,moderate
63,1,74,52.0,155,1,0,0,0,0,0,CAPD,1.0,4,7.0,0,1,0,0,1,1,0,0,0,0,0,0,1.0,0.0,0.0,1.0,2 AZ,0,1,0.0,0,0,0,0,0,0,0,0,0,,,8.2,8.01,71.3,17.1,5.5,175.0,,,3.2,,,,0,0,0,0,0,0,0,0,0,0,0,0,0,0,0,0.0,0,0,1,0,1,0,0,0,0,0,0,0,1,1,1.91,2.04,2.76,69.20289855072464,1.45,1.6,2.22,65.3153153153153,0.0,68.4,80.2,0.0,1.18,0.99,2.0,59.0,Restriction ,moderate
64,1,67,74.0,165,1,1,0,0,0,0,HD,10.0,3,10.0,0,0,1,0,1,1,0,0,0,0,0,0,,,0.0,0.0,2 AZ,1,0,0.0,0,0,0,0,0,0,0,0,0,,,,,,,,,,,,,,,0,0,0,0,0,0,0,0,0,0,0,0,0,1,1,0.0,0,0,0,0,0,0,0,0,0,0,0,2,0,0,1.78,2.4,3.24,54.93827160493827,1.42,1.87,2.58,55.03875968992248,0.0,68.0,79.6,0.0,1.46,1.13,2.27,64.31718061674009,Restriction ,moderate
65,2,34,43.0,156,0,1,0,0,0,0,HD,2.0,3,8.0,1,0,0,0,0,1,0,0,1,0,0,0,1.0,1.0,0.0,0.0,3 PZ,1,0,0.0,0,0,0,0,0,0,0,0,1,3.0,3.0,6.3,5.3,65.3,22.8,2.3,158.0,,,,,,,0,0,0,0,0,0,0,0,0,0,0,0,0,0,1,0.0,0,0,0,1,0,0,0,0,1,0,0,1,1,1,,,,,,,,,,,,,,,,,Cannot interprete,
66,1,63,72.0,164,0,0,0,0,0,1,CAPD,9.0,3,5.0,0,0,1,0,0,1,0,0,0,0,0,0,1.0,1.0,0.0,1.0,2SV + 1 AZ + 1PZ,0,0,0.0,0,0,0,0,0,0,0,0,0,,,7.0,14.14,52.7,6.0,37.1,189.0,,,3.6,,,,0,0,0,0,0,0,0,0,0,0,0,0,1,0,0,0.0,0,0,0,0,0,2,0,0,0,0,0,1,0,2,3.62,2.73,3.56,101.68539325842696,2.63,2.22,2.91,90.37800687285223,0.0,71.7,81.8,0.0,1.92,1.62,2.89,66.43598615916954,Normal ,
67,1,51,63.0,173,1,0,0,0,0,0,HD,6.0,3,8.0,0,1,0,0,1,1,0,0,0,0,0,0,0.0,1.0,1.0,0.0,2AZ+2PZ,1,0,0.0,0,0,0,0,0,0,0,1,0,3.0,3.0,11.4,5.95,84.5,4.4,2.0,143.0,4.8,,3.9,,,0.48,1,0,0,0,0,0,0,0,0,0,1,0,0,0,0,2.0,0,1,0,0,1,0,0,0,0,1,0,1,3,1,,,,,,,,,,,,,,,,,Cannot interprete,
68,1,70,57.0,160,0,0,0,0,0,1,HD,13.0,15,8.0,0,1,0,0,0,1,0,0,0,0,0,0,0.0,0.0,0.0,0.0,2 AZ+mRNA,0,0,0.0,0,0,0,0,0,0,0,0,0,,,,,,,,,,,,,,,0,5,2,0,0,0,0,0,0,0,0,0,0,0,0,0.0,0,0,0,0,0,0,0,0,0,7,0,0,0,0,,,,,,,,,,,,,,,,,Cannot interprete,
69,1,58,57.0,170,0,1,0,0,0,0,CAPD,5.0,3,9.0,0,0,0,1,0,1,0,0,0,0,0,0,0.0,0.0,0.0,0.0,2 AZ,1,0,0.0,0,0,0,0,0,0,0,0,0,,,,,,,,,,,,,,,0,0,0,0,0,0,0,0,0,0,0,0,0,0,0,1.0,0,1,1,0,0,0,0,0,0,0,0,0,3,0,3.18,2.83,3.73,85.25469168900804,2.35,2.25,3.01,78.07308970099669,0.0,69.9,80.4,0.0,1.89,1.5,2.8,67.5,Normal,